{"text_format":"3","workbook":"xlsx","n_sheets":9,"sheets":["Main","Future Intra","Cash Intra","MidCap Intra","Bulk Deals","Call Tracker (Equity & F&O)","Call Tracker (Currency)","Sheet2","Sheet1"],"not_rendered":{"images":4,"defined_names":4},"read":"whole","date_system":"1900"}

{"sheet":"Main","index":0,"n_rows":17,"n_cols":4,"rows_kept":17}
[null,"                                                                                                 "]
{"$rows_empty":8}
[null,"2017-05-03"]
[]
[null,"Sheet No.","Template Name","Summary"]
[null,1,"Future Intra","For Intraday trading in F&O segment"]
[null,2,"Cash Intra","For Intraday trading in cash market segment"]
[null,3,"Mid-cap Intra","For Intraday trading in Mid-cap stocks"]
[null,4,"Bulk Deals","Reveals Bulk Deals carried on NSE & BSE"]
[null,5,"Call Tracker"]

{"sheet":"Future Intra","index":1,"n_rows":250,"n_cols":15,"rows_kept":250,"merged":[[8,0,9,0],[8,1,9,1],[8,2,9,2],[8,5,8,7],[8,8,8,10]]}
[]
[]
[]
[]
[{"$nulls":12},"Back to Main Page"]
["FOR INTRA DAY TRADING",{"$nulls":10},{"$f":"Main!B10","v":"2017-05-03"}]
[]
[]
["Sr.no","Sector","Scrip","CLOSE RATE","Pivot Point","Supports",null,null,"Resistances"]
[null,"Sector",null,"Point","Point","S1","S2","S3","R1","R2","R3","HIGH","LOW","OI","% Change in OI"]
[1,"Index","BANKNIFTY",{"v":25643.7,"d":"25643.70"},{"v":25649.566666666666,"d":"25649.57"},{"v":25555.13333333333,"d":"25555.13"},{"v":25466.566666666666,"d":"25466.57"},{"v":25372.13333333333,"d":"25372.13"},{"v":25738.13333333333,"d":"25738.13"},{"v":25832.566666666666,"d":"25832.57"},{"v":25921.13333333333,"d":"25921.13"},25744,25561,2470800,{"v":0.01714172800474238,"d":"1.71%"}]
[2,"Index","NIFTY",{"v":10739.4,"d":"10739.40"},{"v":10743.783333333333,"d":"10743.78"},{"v":10701.616666666665,"d":"10701.62"},{"v":10663.833333333332,"d":"10663.83"},{"v":10621.666666666664,"d":"10621.67"},{"v":10781.566666666666,"d":"10781.57"},{"v":10823.733333333334,"d":"10823.73"},{"v":10861.516666666666,"d":"10861.52"},10785.95,10706,24545700,{"v":-1.1506075024492375E-3,"d":"-0.12%"}]
[3,"Index","NIFTYCPSE",{"v":2627.4,"d":"2627.40"},{"v":875.8000000000001,"d":"875.80"},{"v":1751.6000000000001,"d":"1751.60"},{"v":875.8000000000001,"d":"875.80"},{"v":1751.6000000000001,"d":"1751.60"},{"v":1751.6000000000001,"d":"1751.60"},{"v":875.8000000000001,"d":"875.80"},{"v":1751.6000000000001,"d":"1751.60"},0,0,0,{"v":0,"d":"0.00%"}]
[4,"Index","NIFTYINFRA",{"v":3441.1,"d":"3441.10"},{"v":1147.0333333333333,"d":"1147.03"},{"v":2294.0666666666666,"d":"2294.07"},{"v":1147.0333333333333,"d":"1147.03"},{"v":2294.0666666666666,"d":"2294.07"},{"v":2294.0666666666666,"d":"2294.07"},{"v":1147.0333333333333,"d":"1147.03"},{"v":2294.0666666666666,"d":"2294.07"},0,0,0,{"v":0,"d":"0.00%"}]
[5,"Index","NIFTYIT",{"v":13796,"d":"13796.00"},{"v":13846.333333333334,"d":"13846.33"},{"v":13714.666666666668,"d":"13714.67"},{"v":13633.333333333334,"d":"13633.33"},{"v":13501.666666666668,"d":"13501.67"},{"v":13927.666666666668,"d":"13927.67"},{"v":14059.333333333336,"d":"14059.33"},{"v":14140.666666666668,"d":"14140.67"},13978,13765,57250,{"v":0.19769874476987448,"d":"19.77%"}]
[6,"Index","NIFTYMID50",{"v":5152,"d":"5152.00"},{"v":1717.3333333333333,"d":"1717.33"},{"v":3434.6666666666665,"d":"3434.67"},{"v":1717.3333333333333,"d":"1717.33"},{"v":3434.6666666666665,"d":"3434.67"},{"v":3434.6666666666665,"d":"3434.67"},{"v":1717.3333333333333,"d":"1717.33"},{"v":3434.6666666666665,"d":"3434.67"},0,0,591400,{"v":0,"d":"0.00%"}]
[7,"Index","NIFTYPSE",4077.45,{"v":1359.1499999999999,"d":"1359.15"},{"v":2718.2999999999997,"d":"2718.30"},{"v":1359.1499999999999,"d":"1359.15"},{"v":2718.2999999999997,"d":"2718.30"},{"v":2718.2999999999997,"d":"2718.30"},{"v":1359.1499999999999,"d":"1359.15"},{"v":2718.2999999999997,"d":"2718.30"},0,0,0,{"v":0,"d":"0.00%"}]
[8,"Cement","ACC",1551.15,1561.05,{"v":1532.1,"d":"1532.10"},1513.05,{"v":1484.1,"d":"1484.10"},{"v":1580.1,"d":"1580.10"},{"v":1609.0500000000002,"d":"1609.05"},{"v":1628.1,"d":"1628.10"},1590,1542,1533600,{"v":0.018867924528301886,"d":"1.89%"}]
[9,"Others","ADANIENT",129.35,{"v":132.1,"d":"132.10"},{"v":121.89999999999998,"d":"121.90"},{"v":114.44999999999999,"d":"114.45"},{"v":104.24999999999997,"d":"104.25"},{"v":139.54999999999998,"d":"139.55"},{"v":149.74999999999997,"d":"149.75"},{"v":157.2,"d":"157.20"},142.3,124.65,13932000,{"v":0.014564520827264784,"d":"1.46%"}]
[10,"Others","ADANIPORTS",{"v":401.9,"d":"401.90"},{"v":404.1499999999999,"d":"404.15"},{"v":396.09999999999985,"d":"396.10"},{"v":390.29999999999995,"d":"390.30"},{"v":382.2499999999999,"d":"382.25"},{"v":409.9499999999998,"d":"409.95"},{"v":417.9999999999999,"d":"418.00"},{"v":423.7999999999998,"d":"423.80"},412.2,398.35,14430000,{"v":-0.009608785175017159,"d":"-0.96%"}]
{"$rows_left_out":224}
{"sheet":"Cash Intra","index":2,"n_rows":248,"n_cols":13,"rows_kept":248,"merged":[[7,0,8,0],[7,1,8,1],[7,2,8,2],[7,3,8,3],[7,4,7,6],[7,7,7,9]]}
[]
[]
[]
[]
[{"$nulls":12},"Back to Main Page"]
["FOR INTRA DAY TRADING",{"$nulls":9},{"$f":"Main!B10","v":"2017-05-03"}]
[]
["Sr.no","Scrip","CLOSE RATE","Pivot Point","Supports",null,null,"Resistances"]
[null,null,"Point",null,"S1","S2","S3","R1","R2","R3","HIGH","LOW","Total Trade Quanity in Lakhs"]
[1,"Nifty 50",10718.05,{"v":10730.833333333332,"d":"10730.83"},{"v":10677.016666666665,"d":"10677.02"},{"v":10635.983333333332,"d":"10635.98"},{"v":10582.166666666664,"d":"10582.17"},{"v":10771.866666666665,"d":"10771.87"},{"v":10825.68333333333,"d":"10825.68"},{"v":10866.716666666665,"d":"10866.72"},10784.65,10689.8]
[2,"Nifty Bank",25568.3,{"v":25594.8,"d":"25594.80"},25472.85,{"v":25377.399999999998,"d":"25377.40"},{"v":25255.449999999997,"d":"25255.45"},25690.25,{"v":25812.200000000004,"d":"25812.20"},25907.65,25716.75,25499.35]
[3,"Nifty CPSE",2379.3,{"v":2388.5833333333335,"d":"2388.58"},{"v":2366.166666666667,"d":"2366.17"},{"v":2353.0333333333333,"d":"2353.03"},{"v":2330.616666666667,"d":"2330.62"},{"v":2401.716666666667,"d":"2401.72"},{"v":2424.133333333334,"d":"2424.13"},{"v":2437.2666666666673,"d":"2437.27"},2411,2375.45]
[4,"Nifty Infra",3479.9,{"v":3494.2999999999997,"d":"3494.30"},{"v":3458.6999999999994,"d":"3458.70"},{"v":3437.4999999999995,"d":"3437.50"},{"v":3401.899999999999,"d":"3401.90"},{"v":3515.4999999999995,"d":"3515.50"},{"v":3551.1,"d":"3551.10"},{"v":3572.2999999999997,"d":"3572.30"},3529.9,3473.1]
[5,"Nifty IT",13754.3,{"v":13821.166666666666,"d":"13821.17"},{"v":13656.783333333333,"d":"13656.78"},{"v":13559.266666666666,"d":"13559.27"},{"v":13394.883333333333,"d":"13394.88"},{"v":13918.683333333332,"d":"13918.68"},{"v":14083.066666666668,"d":"14083.07"},{"v":14180.583333333332,"d":"14180.58"},13985.55,13723.65]
[6,"Nifty PSE",3800.95,{"v":3818.3333333333335,"d":"3818.33"},{"v":3778.366666666667,"d":"3778.37"},{"v":3755.7833333333333,"d":"3755.78"},{"v":3715.8166666666666,"d":"3715.82"},{"v":3840.916666666667,"d":"3840.92"},{"v":3880.883333333333,"d":"3880.88"},{"v":3903.466666666667,"d":"3903.47"},3858.3,3795.75]
[7,"Nifty Midcap 50",5365.4,{"v":5393.416666666667,"d":"5393.42"},{"v":5312.683333333334,"d":"5312.68"},{"v":5259.966666666667,"d":"5259.97"},{"v":5179.2333333333345,"d":"5179.23"},{"v":5446.133333333334,"d":"5446.13"},{"v":5526.866666666666,"d":"5526.87"},{"v":5579.583333333334,"d":"5579.58"},5474.15,5340.7]
[8,"ABB",170.55,{"v":173.8166666666667,"d":"173.82"},{"v":172.63333333333338,"d":"172.63"},{"v":174.7166666666667,"d":"174.72"},{"v":173.5333333333334,"d":"173.53"},{"v":171.73333333333338,"d":"171.73"},{"v":172.9166666666667,"d":"172.92"},{"v":170.83333333333337,"d":"170.83"},175,175.9,1.75E-3]
[9,"ACC",145.5,{"v":146.48333333333332,"d":"146.48"},{"v":146.46666666666664,"d":"146.47"},{"v":147.4333333333333,"d":"147.43"},{"v":147.41666666666663,"d":"147.42"},{"v":145.51666666666665,"d":"145.52"},{"v":145.53333333333336,"d":"145.53"},{"v":144.56666666666666,"d":"144.57"},146.5,147.45,0.0014675]
[10,"AIAENG",353.55,{"v":371.3833333333334,"d":"371.38"},{"v":362.76666666666677,"d":"362.77"},{"v":371.9833333333334,"d":"371.98"},{"v":363.3666666666668,"d":"363.37"},{"v":362.16666666666674,"d":"362.17"},{"v":370.7833333333334,"d":"370.78"},{"v":361.5666666666667,"d":"361.57"},380,380.6,0.003625]
[11,"AUBANK",445.1,{"v":447.2833333333333,"d":"447.28"},{"v":449.0666666666666,"d":"449.07"},{"v":453.0333333333333,"d":"453.03"},{"v":454.8166666666666,"d":"454.82"},{"v":443.3166666666666,"d":"443.32"},{"v":441.5333333333333,"d":"441.53"},{"v":437.5666666666666,"d":"437.57"},445.5,451.25,0.0044425]
{"$rows_left_out":229}
{"sheet":"MidCap Intra","index":3,"n_rows":508,"n_cols":13,"rows_kept":508,"merged":[[0,0,0,1],[8,0,9,0],[8,1,9,1],[8,2,9,2],[8,3,9,3],[8,4,8,6],[8,7,8,9]]}
[]
[]
[]
[]
[{"$nulls":11},"Back To Main Page"]
["FOR INTRA DAY TRADING",{"$nulls":9},{"$f":"Main!B10","v":"2017-05-03"}]
[null,null," "]
[]
["Sr.no","Scrip","CLOSE RATE","Pivot Point","Supports",null,null,"Resistances"]
[null,null,"Point",null,"S1","S2","S3","R1","R2","R3","HIGH","LOW","Total Trade Quanity in Lakhs"]
[1,"3MINDIA",20320,{"v":20625.133333333335,"d":"20625.13"},{"v":20724.86666666667,"d":"20724.87"},{"v":21129.733333333334,"d":"21129.73"},{"v":21229.466666666667,"d":"21229.47"},{"v":20220.26666666667,"d":"20220.27"},{"v":20120.53333333334,"d":"20120.53"},{"v":19715.66666666667,"d":"19715.67"},20525.4,21030,0.20524099999999998]
[2,"8KMILES",87,{"v":89.51666666666667,"d":"89.52"},{"v":88.88333333333333,"d":"88.88"},{"v":90.76666666666667,"d":"90.77"},{"v":90.13333333333333,"d":"90.13"},{"v":87.63333333333333,"d":"87.63"},{"v":88.26666666666668,"d":"88.27"},{"v":86.38333333333333,"d":"86.38"},90.15,91.4,9.0400000000000007E-4]
[3,"ABB",170.55,{"v":173.8166666666667,"d":"173.82"},{"v":172.63333333333338,"d":"172.63"},{"v":174.7166666666667,"d":"174.72"},{"v":173.5333333333334,"d":"173.53"},{"v":171.73333333333338,"d":"171.73"},{"v":172.9166666666667,"d":"172.92"},{"v":170.83333333333337,"d":"170.83"},175,175.9,1.75E-3]
[4,"ACC",145.5,{"v":146.48333333333332,"d":"146.48"},{"v":146.46666666666664,"d":"146.47"},{"v":147.4333333333333,"d":"147.43"},{"v":147.41666666666663,"d":"147.42"},{"v":145.51666666666665,"d":"145.52"},{"v":145.53333333333336,"d":"145.53"},{"v":144.56666666666666,"d":"144.57"},146.5,147.45,0.0014675]
[5,"AIAENG",353.55,{"v":371.3833333333334,"d":"371.38"},{"v":362.76666666666677,"d":"362.77"},{"v":371.9833333333334,"d":"371.98"},{"v":363.3666666666668,"d":"363.37"},{"v":362.16666666666674,"d":"362.17"},{"v":370.7833333333334,"d":"370.78"},{"v":361.5666666666667,"d":"361.57"},380,380.6,0.003625]
[6,"APLAPOLLO",579,{"v":597.3333333333334,"d":"597.33"},{"v":594.5666666666667,"d":"594.57"},{"v":610.1333333333333,"d":"610.13"},{"v":607.3666666666667,"d":"607.37"},{"v":581.7666666666668,"d":"581.77"},{"v":584.5333333333334,"d":"584.53"},{"v":568.9666666666668,"d":"568.97"},600.1,612.9,5.9429999999999995E-3]
[7,"AUBANK",445.1,{"v":447.2833333333333,"d":"447.28"},{"v":449.0666666666666,"d":"449.07"},{"v":453.0333333333333,"d":"453.03"},{"v":454.8166666666666,"d":"454.82"},{"v":443.3166666666666,"d":"443.32"},{"v":441.5333333333333,"d":"441.53"},{"v":437.5666666666666,"d":"437.57"},445.5,451.25,0.0044425]
[8,"AARTIIND",570,{"v":577.5166666666667,"d":"577.52"},{"v":579.4833333333333,"d":"579.48"},{"v":588.9666666666667,"d":"588.97"},{"v":590.9333333333334,"d":"590.93"},{"v":568.0333333333333,"d":"568.03"},{"v":566.0666666666666,"d":"566.07"},{"v":556.5833333333333,"d":"556.58"},575.55,587,0.005737000000000001]
[9,"ABAN",43.1,{"v":45.699999999999996,"d":"45.70"},{"v":45.39999999999999,"d":"45.40"},{"v":47.699999999999996,"d":"47.70"},{"v":47.39999999999999,"d":"47.40"},{"v":43.39999999999999,"d":"43.40"},{"v":43.69999999999999,"d":"43.70"},{"v":41.39999999999999,"d":"41.40"},46,48,4.5450000000000004E-4]
[10,"ADANIENT",180.4,{"v":185.26666666666665,"d":"185.27"},{"v":183.0333333333333,"d":"183.03"},{"v":185.66666666666666,"d":"185.67"},{"v":183.4333333333333,"d":"183.43"},{"v":182.6333333333333,"d":"182.63"},{"v":184.86666666666665,"d":"184.87"},{"v":182.2333333333333,"d":"182.23"},187.5,187.9,1.869E-3]
{"$rows_left_out":489}
{"sheet":"Bulk Deals","index":4,"n_rows":102,"n_cols":8,"rows_kept":102,"merged":[[4,0,4,1],[4,2,4,3],[6,1,6,2]]}
[" "]
[]
[]
[]
[]
[{"$nulls":4},"Back To Main Page"]
["Subject :","BULK DEAL",null,{"$f":"Main!B10","v":"2017-05-03"}]
[]
["Date","Scrip code","Scrip Name","Client Name","Buy / Sell","Quantity Traded","Trade Price / Wt.Avg.trade price","Exchange  "]
["2018-05-02",540024,"ASHARI","PREYASHBHAI SATHVARA","SELL",{"v":54206,"d":"54,206"},71.57,"BSE"]
["2018-05-02",540024,"ASHARI","PREYASHBHAI SATHVARA","BUY",{"v":54206,"d":"54,206"},71.55,"BSE"]
["2018-05-02",539770,"DARJEELING","PRASHANT B KOTHAMDI","SELL",{"v":18500,"d":"18,500"},20.24,"BSE"]
["2018-05-02",524818,"DYNAMIND","MONEY GROW INVESTMENT","SELL",{"v":42654,"d":"42,654"},115.4,"BSE"]
["2018-05-02",524818,"DYNAMIND","MONEY GROW INVESTMENT","BUY",{"v":42654,"d":"42,654"},112.2,"BSE"]
["2018-05-02",524818,"DYNAMIND","NITIN SINGH BHATI","SELL",{"v":18000,"d":"18,000"},110.81,"BSE"]
["2018-05-02",539844,"EQUITAS","CREATION INVESTMENTS EQUITAS HOLDINGS LLC","SELL",{"v":2424812,"d":"2,424,812"},165,"BSE"]
["2018-05-02",514474,"FAIRDSY","MEGHANA PREMAL SHAH","SELL",{"v":40000,"d":"40,000"},104,"BSE"]
["2018-05-02",541276,"GARVIND","SANDEEP GOYAL","SELL",{"v":150000,"d":"150,000"},10,"BSE"]
["2018-05-02",541276,"GARVIND","PRADEEP GOYAL","SELL",{"v":80000,"d":"80,000"},10,"BSE"]
["2018-05-02",541276,"GARVIND","GOEL KANCHAN","SELL",{"v":150000,"d":"150,000"},10,"BSE"]
{"$rows_left_out":83}
{"sheet":"Call Tracker (Equity & F&O)","index":5,"n_rows":242,"n_cols":19,"rows_kept":242,"merged":[[8,9,8,10],[9,9,9,10],[10,9,10,10],[11,9,11,10],[12,9,12,10],[13,9,13,10],[14,9,14,10],[15,9,15,10],[16,9,16,10],[29,9,29,10],[34,9,34,10],[44,9,44,10],[45,9,45,10],[49,9,49,10],[51,9,51,10],[52,9,52,10],[53,9,53,10],[54,9,54,10],[55,9,55,10],[56,9,56,10],[57,9,57,10],[58,9,58,10],[59,9,59,10],[60,9,60,10],[70,9,70,10],[76,9,76,10],[77,9,77,10],[78,9,78,10],[79,9,79,10],[86,9,86,10],[87,9,87,10],[88,9,88,10],[89,9,89,10],[90,9,90,10],[91,9,91,10],[92,9,92,10],[93,9,93,10],[94,9,94,10],[95,9,95,10],[96,9,96,10],[97,9,97,10],[98,9,98,10],[105,9,105,10],[106,9,106,10],[107,9,107,10],[110,9,110,10],[111,9,111,10],[112,9,112,10],[113,9,113,10],[114,9,114,10],[115,9,115,10],[116,9,116,10],[117,9,117,10],[118,9,118,10],[119,9,119,10],[120,9,120,10],[121,9,121,10],[122,9,122,10],[123,9,123,10],[124,9,124,10],[125,9,125,10],[126,9,126,10],[127,9,127,10],[128,9,128,10],[129,9,129,10],[130,9,130,10],[131,9,131,10],[132,9,132,10],[133,9,133,10],[134,9,134,10],[135,9,135,10],[136,9,136,10],[137,9,137,10],[138,9,138,10],[139,9,139,10],[140,9,140,10],[141,9,141,10],[142,9,142,10],[143,9,143,10],[144,9,144,10],[145,9,145,10],[146,9,146,10],[147,9,147,10],[148,9,148,10],[149,9,149,10],[150,9,150,10],[151,9,151,10],[152,9,152,10],[153,9,153,10],[154,9,154,10],[155,9,155,10],[156,9,156,10],[157,9,157,10],[158,9,158,10],[159,9,159,10],[160,9,160,10],[161,9,161,10],[162,9,162,10],[163,9,163,10],[164,9,164,10],[165,9,165,10],[166,9,166,10],[167,9,167,10],[168,9,168,10],[169,9,169,10],[170,9,170,10],[171,9,171,10],[172,9,172,10],[173,9,173,10],[174,9,174,10],[175,9,175,10],[176,9,176,10],[178,9,178,10],[179,9,179,10],[180,9,180,10],[181,9,181,10],[182,9,182,10],[183,9,183,10],[184,9,184,10],[185,9,185,10],[186,9,186,10],[187,9,187,10],[188,9,188,10],[189,9,189,10],[190,9,190,10],[191,9,191,10],[192,9,192,10],[193,9,193,10],[194,9,194,10],[195,9,195,10],[196,9,196,10],[197,9,197,10],[198,9,198,10],[199,9,199,10],[200,9,200,10],[201,9,201,10],[202,9,202,10],[203,9,203,10],[204,9,204,10],[205,9,205,10],[206,9,206,10],[207,9,207,10],[208,9,208,10],[209,9,209,10],[210,9,210,10],[211,9,211,10],[212,9,212,10],[213,9,213,10],[214,9,214,10],[215,9,215,10],[216,9,216,10],[217,9,217,10],[218,9,218,10],[219,9,219,10],[220,9,220,10],[221,9,221,10],[222,9,222,10],[223,9,223,10],[224,9,224,10],[225,9,225,10],[226,9,226,10],[227,9,227,10],[228,9,228,10],[229,9,229,10],[230,9,230,10]]}
[]
[]
[]
[]
[{"$nulls":13},"Back To Main Page"]
["Retail Research Technical Calls & Fundamental Performance Report for the month of May -2018 "]
[{"$nulls":13},{"$f":"Main!B10","v":"2017-05-03"}]
[null,"Positional  Call"]
["Sr.no","Date",null,"Company","Rec","Rec Price","Stop Loss***","Call Closed At","Target","Remark",null,"Profit / Loss per Share","Gain / Loss  %","Status","Closed Date","NSE Closed Price"]
[1,"2018-02-12",null,"ITC","Buy",271.5,250,285,310,"Profit of Rs.13.5/-",null,{"$f":"H10-F10","v":13.5},{"$f":"L10/F10","v":{"v":0.049723756906077346,"d":"4.97%"}},"Successful","2018-05-02",{"$nulls":3},"P"]
[1,"2018-04-05",null,"RECLTD","Buy","128-130",122,null,140,"Open",{"$nulls":5},{"$f":"VLOOKUP(D11,Sheet2!$A$1:M2148,6,0)","v":127.5},null,null,"R"]
[2,"2018-04-11",null,"FEDERALBNK","Buy","98-50-99.00",94,null,"106-109","Open",{"$nulls":5},{"$f":"VLOOKUP(D12,Sheet2!$A$1:M2151,6,0)","v":98.3},null,null,"R"]
[4,"2018-04-18",null,"BHEL","Buy","88-89",83,null,100,"Open",{"$nulls":5},{"$f":"VLOOKUP(D13,Sheet2!$A$1:M2152,6,0)","v":87.8},null,null,"A"]
[5,"2018-04-20",null,"HINDZINC","Sell",325.5,340,314.5,"310-305","Profit of Rs.11/-",null,{"$f":"F14-H14","v":11},{"$f":"L14/F14","v":{"v":0.03379416282642089,"d":"3.38%"}},"Successful","2018-05-02",{"$nulls":3},"H"]
[6,"2018-04-26",null,"HCLTECH","Buy",1060,1018,1015,"1130-1150","Loss of Rs.45/-",null,{"$f":"H15-F15","v":-45},{"v":-0.04245283018867924,"d":"-4.25%"},"Unsuccessful","2018-05-02",{"$nulls":3},"H"]
[7,"2018-04-27",null,"PFC","Buy",85.8,82.5,89.45,"91-93","Profit of Rs.3.65/-",null,{"$f":"H16-F16","v":3.6500000000000057},{"$f":"L16/F16","v":{"v":0.042540792540792606,"d":"4.25%"}},"Successful","2018-05-02",{"$nulls":3},"H"]
[8,"2018-04-30",null,"HEXAWARE","Sell","443-447",464,null,"410-400","Open",{"$nulls":5},{"$f":"VLOOKUP(D17,Sheet2!$A$1:M2158,6,0)","v":448.9},null,null,"H"]
{"$rows_empty":13}
["CLBS = Closing Basis ***",{"$nulls":4},"Reinitiated $"]
["Dividend adjusted <>",{"$nulls":4},"Revised stoploss #"]
{"$rows_left_out":187}
{"sheet":"Call Tracker (Currency)","index":6,"n_rows":58,"n_cols":18,"rows_kept":58,"merged":[[1,8,1,9],[2,8,2,9],[3,8,3,9],[4,8,4,9],[5,8,5,9],[6,8,6,9],[7,8,7,9],[8,8,8,9],[9,8,9,9],[10,8,10,9],[11,8,11,9],[12,8,12,9],[13,8,13,9],[14,8,14,9],[15,8,15,9],[16,8,16,9],[17,8,17,9],[18,8,18,9],[19,8,19,9],[20,8,20,9],[21,8,21,9],[22,8,22,9],[23,8,23,9],[24,8,24,9],[25,8,25,9],[26,8,26,9],[27,8,27,9],[28,8,28,9],[29,8,29,9],[30,8,30,9],[31,8,31,9],[32,8,32,9],[33,8,33,9],[34,8,34,9],[35,8,35,9],[36,8,36,9],[37,8,37,9],[38,8,38,9],[39,8,39,9],[40,8,40,9],[41,8,41,9],[42,8,42,9],[43,8,43,9],[44,8,44,9],[45,8,45,9],[46,8,46,9],[47,8,47,9],[48,8,48,9],[49,8,49,9],[50,8,50,9],[51,8,51,9],[52,8,52,9],[53,8,53,9],[54,8,54,9],[55,8,55,9],[56,8,56,9],[57,8,57,9],[58,8,58,9],[59,8,59,9],[60,8,60,9],[61,8,61,9],[62,8,62,9],[63,8,63,9],[64,8,64,9],[65,8,65,9],[66,8,66,9],[67,8,67,9],[68,8,68,9],[69,8,69,9],[70,8,70,9],[71,8,71,9],[72,8,72,9],[73,8,73,9],[74,8,74,9],[75,8,75,9],[76,8,76,9],[77,8,77,9],[78,8,78,9],[79,8,79,9],[80,8,80,9],[81,8,81,9],[82,8,82,9],[83,8,83,9],[84,8,84,9],[85,8,85,9],[86,8,86,9],[87,8,87,9],[88,8,88,9],[89,8,89,9],[90,8,90,9],[91,8,91,9],[92,8,92,9],[93,8,93,9],[94,8,94,9],[95,8,95,9],[96,8,96,9],[97,8,97,9],[98,8,98,9],[99,8,99,9],[100,8,100,9],[101,8,101,9],[102,8,102,9],[103,8,103,9],[104,8,104,9],[105,8,105,9],[106,8,106,9],[107,8,107,9],[108,8,108,9],[109,8,109,9],[110,8,110,9],[111,8,111,9],[112,8,112,9],[113,8,113,9],[114,8,114,9],[115,8,115,9],[116,8,116,9],[117,8,117,9],[118,8,118,9],[119,8,119,9],[120,8,120,9],[121,8,121,9],[122,8,122,9],[123,8,123,9],[124,8,124,9]]}
["Master Trade High Risk"]
["Sr.no","Date","Company","Rec","Rec Price","Stop Loss","Call Closed At","Target","Remark",null,"Profit / Loss per share","Gain / Loss  per Lot","Lot","Status","Closed Date"]
[1,"2017-05-08","USDINR MAY FUT","Buy",64.3935,64.29,64.66,64.59,"Profit of Rs.0.27/-",null,{"v":0.2664999999999935,"d":"0.27"},266.4999999999935,1000,"Successful","2017-05-09",null,null,"P"]
[2,"2017-05-08","USDINR JUN FUT","Buy",64.6535,64.45,64.965,65.05,"Profit of Rs 0.31/-",null,{"v":0.31150000000000944,"d":"0.31"},311.50000000000944,1000,"Successful","2017-05-09",null,null,"P"]
[3,"2017-05-09","EUROINR MAY FUT","Sell",70.65,70.8,70.07,70.4,"Profit of Rs 0.58/-",null,{"v":0.580000000000013,"d":"0.58"},580.00000000001,1000,"Successful","2017-05-12",null,null,"P"]
[4,"2017-05-09","GBPINR MAY FUT","Buy",83.774,83.37,83.37,84.77,"Loss of Rs 0.40/-",null,{"v":-0.40399999999999636,"d":"-0.40"},-403.99999999999636,1000,"Unsuccessful","2017-05-11",null,null,"P"]
[5,"2017-05-11","USDINR MAY FUT","Buy",64.6555,64.55,64.55,64.86,"Loss of Rs.0.1055/-",null,-0.10550000000000637,{"$f":"K7*M7","v":{"v":-105.50000000000637,"d":"-105.50"}},1000,"Unsuccessful","2017-05-11",null,null,"P"]
[6,"2017-05-15","USDINR MAY FUT","Buy",64.2275,64.08,64.46,64.48,"Profit of Rs 0.23/-",null,{"v":0.2324999999999875,"d":"0.23"},232.4999999999875,1000,"Successful","2017-05-18",null,null,"P"]
[7,"2017-05-19","USDINR MAY FUT","Sell",64.83,65,65,64.5,"Loss of Rs.0.17/-",null,{"v":-0.1700000000000017,"d":"-0.17"},-170.0000000000017,1000,"Unsuccessful","2017-05-19",null,null,"P"]
[8,"2017-05-23","USDINR MAY FUT","Buy",64.83,64.62,64.95,65.2,"Profit of Rs 0.12/-",null,{"v":0.12000000000000455,"d":"0.12"},120.00000000000455,1000,"Successful","2017-05-24",null,null,"P"]
[9,"2017-05-25","USDINR MAY FUT","Buy",64.57,64.25,64.56,65,"Loss of Rs.0.01/-",null,-0.009999999999990905,-9.999999999990905,1000,"Neutral","2017-05-29",null,null,"P"]
[10,"2017-05-30","USDINR JUN FUT","Buy",64.9125,64.71,64.71,65.31,"Loss of Rs.0.20/-",null,{"v":-0.20250000000000057,"d":"-0.20"},-202.50000000000057,1000,"Unsuccessful","2017-05-31",null,null,"P"]
[11,"2017-06-01","USDINR JUN FUT","Buy",64.655,64.45,64.45,65.05,"Loss of Rs.0.20/-",null,{"$f":"G13-E13","v":{"v":-0.2049999999999983,"d":"-0.20"}},{"$f":"K13*M13","v":-204.9999999999983},{"v":1000,"d":"1000.00"},"Unsuccessful","2017-06-08",null,null,"P"]
[12,"2017-06-12","USDINR JUN FUT","Buy",64.45,64,64.7625,65.2,"Profit of Rs 0.31/-",null,{"v":0.3125,"d":"0.31"},312.5,1000,"Successful","2017-06-16"]
[13,"2017-06-16","USDINR JUN FUT","Buy",64.51,64.2,64.7,65.11,"Profit of Rs 0.19/-",null,{"v":0.18999999999999773,"d":"0.19"},189.99999999999773,1000,"Successful","2017-06-21"]
[14,"2017-06-22","USDINR JUN FUT","Buy",64.56,64.2,64.2,65.1,"Loss of Rs.0.36/-",null,{"v":-0.35999999999999943,"d":"-0.36"},-359.99999999999943,{"v":1000,"d":"1000.00"},"Unsuccessful","2017-06-30"]
[15,"2017-07-10","USDINR JUL FUT","Buy",64.67,64.4,64.4,65.15,"Loss of Rs.0.27/-",null,{"v":-0.269999999999996,"d":"-0.27"},-269.999999999996,{"v":1000,"d":"1000.00"},"Unsuccessful","2017-07-31"]
[16,"2017-08-02","USDINR AUG FUT","Buy",64.235,63.98,63.98,64.75,"Loss of Rs.0.26/-",null,{"v":-0.25500000000000256,"d":"-0.26"},-255.00000000000256,{"v":1000,"d":"1000.00"},"Unsuccessful","2017-08-02"]
[17,"2017-08-08","USDINR AUG FUT","Buy",63.9425,63.6,64.15,64.5,"Profit of Rs 0.21/-",null,{"v":0.20750000000000313,"d":"0.21"},207.50000000000313,1000,"Successful","2017-08-10"]
[18,"2017-08-22","USDINR AUG FUT","Buy",64.1175,63.9,64.01,64.5,"Loss of Rs.0.11/-",null,{"$f":"G20-E20","v":{"v":-0.1075000000000017,"d":"-0.11"}},{"$f":"K20*M20","v":-107.5000000000017},{"v":1000,"d":"1000.00"},"Unsuccessful","2017-08-29"]
{"$rows_left_out":39}
{"sheet":"Sheet2","index":7,"n_rows":1500,"n_cols":13,"rows_kept":1500,"hidden":true}
["SYMBOL","SERIES","OPEN","HIGH","LOW","CLOSE","LAST","PREVCLOSE","TOTTRDQTY","TOTTRDVAL","TIMESTAMP","TOTALTRADES","ISIN"]
["20MICRONS","EQ",48.6,49.85,46.85,47.6,47.45,49.15,157120,7573043.6,"2018-04-30",971,"INE144J01027"]
["21STCENMGM","EQ",44.7,44.7,44.7,44.7,44.7,43.85,14455,646138.5,"2018-04-30",22,"INE253B01015"]
["3IINFOTECH","EQ",4.95,5,4.85,4.95,4.95,4.9,1174232,5791781.75,"2018-04-30",738,"INE748C01020"]
["3MINDIA","EQ",20700,20700,20455,20524.1,20455,20479.2,675,13850315.4,"2018-04-30",350,"INE470A01017"]
["63MOONS","EQ",91.6,95,90,90.4,90.4,90.55,159602,14582357.7,"2018-04-30",2775,"INE111B01023"]
["8KMILES","EQ",802.95,809.55,778.3,786.1,784,795.65,127879,101208545.65,"2018-04-30",5532,"INE650K01021"]
["A2ZINFRA","EQ",27.25,27.9,26.5,26.75,26.6,27.1,270864,7290270.7,"2018-04-30",1058,"INE619I01012"]
["AARTIDRUGS","EQ",587.65,590,571.7,573.7,573.05,584.4,2211,1285307.3,"2018-04-30",273,"INE767A01016"]
["AARTIIND","EQ",1327,1358.15,1327,1343.45,1337,1325.9,36743,49228506.95,"2018-04-30",2794,"INE769A01020"]
["AARVEEDEN","EQ",45.3,49,42.8,45.45,45.1,43.9,142729,6611675.3,"2018-04-30",1192,"INE273D01019"]
["ABAN","EQ",174.05,178.9,173.5,175,174.6,173.85,1404810,247466882.7,"2018-04-30",12888,"INE421A01028"]
["ABB","EQ",1349.2,1370,1340.15,1358.5,1356.35,1339.75,52088,70464304.25,"2018-04-30",3572,"INE117A01022"]
["ABBOTINDIA","EQ",6140,6259.4,6140,6179.65,6199,6157.75,4816,29862102.9,"2018-04-30",993,"INE358A01014"]
["ABCAPITAL","EQ",157.45,162,157.1,159.75,160,156.3,2127844,340210895.6,"2018-04-30",19900,"INE674K01013"]
["ABFRL","EQ",145.9,148,145.85,146.75,147,145.3,134495,19740326.05,"2018-04-30",1887,"INE647O01011"]
["ACC","EQ",1564.85,1599.9,1563,1587.15,1583.5,1559.6,265415,421301133.9,"2018-04-30",12356,"INE012A01025"]
["ACCELYA","EQ",1346.55,1349.25,1310,1336.5,1326.35,1348.2,4969,6599463.2,"2018-04-30",589,"INE793A01012"]
["ACE","EQ",184.5,189.9,182.9,186.9,186.6,183.2,501618,93856209.85,"2018-04-30",4874,"INE731H01025"]
["ADANIENT","EQ",142.35,144.4,138.6,140.1,140.3,141.8,2549744,360937708.35,"2018-04-30",15706,"INE423A01024"]
{"$rows_left_out":1481}
{"sheet":"Sheet1","index":8,"n_rows":0,"n_cols":0,"rows_kept":0}