{"text_format":"3","workbook":"xlsx","n_sheets":6,"sheets":["Main","Future Intra","Cash Intra","MidCap Intra","Bulk Deals","Call Tracker (Equity & F&O)"],"not_rendered":{"images":4,"defined_names":1},"read":"whole","date_system":"1900"}

{"sheet":"Main","index":0,"n_rows":27,"n_cols":11,"rows_kept":27}
[null,"                                                                                                 "]
[]
[]
[]
[]
[{"$nulls":6}," "]
[]
[]
[]
[null,"2024-05-03"]
[]
[null,"Sheet No.","Template Name","Summary"]
[null,1,"Future Intra","For Intraday trading in F&O segment"]
[null,2,"Cash Intra","For Intraday trading in cash market segment"]
[null,3,"Mid-cap Intra","For Intraday trading in Mid-cap stocks"]
[null,4,"Bulk Deals","Reveals Bulk Deals carried on NSE & BSE"]
[null,5,"Call Tracker"]
{"$rows_empty":9}
[{"$nulls":10},"`"]

{"sheet":"Future Intra","index":1,"n_rows":236,"n_cols":16,"rows_kept":236,"merged":[[8,0,9,0],[8,1,9,1],[8,2,9,2],[8,3,9,3],[8,6,8,8],[8,9,8,11]]}
[]
[]
[]
[]
[{"$nulls":12},"Back to Main Page"]
["FOR INTRA DAY TRADING",{"$nulls":10},{"$f":"Main!B10","v":"2024-05-03"}]
[]
[]
["Sr.no","Sector","Scrip","Expiry Date","CLOSE RATE","Pivot Point","Supports",null,null,"Resistances"]
[{"$nulls":4},"Point","Point","S1","S2","S3","R1","R2","R3","HIGH","LOW","OI","% Change in OI"]
[1,"Index","NIFTY","2024-05-30",22773.95,{"v":22756.800000000003,"d":"22756.80"},{"v":22705.200000000004,"d":"22705.20"},22636.45,{"v":22584.850000000002,"d":"22584.85"},{"v":22825.550000000007,"d":"22825.55"},{"v":22877.150000000005,"d":"22877.15"},{"v":22945.90000000001,"d":"22945.90"},22808.4,22688.05,12230675,{"v":0.02502068994416334,"d":"2.50%"}]
[2,"Index","BANKNIFTY","2024-05-29",49388.35,{"v":49382.4,"d":"49382.40"},{"v":49176.8,"d":"49176.80"},48965.25,48759.65,{"v":49593.950000000004,"d":"49593.95"},{"v":49799.549999999996,"d":"49799.55"},{"v":50011.100000000006,"d":"50011.10"},49588,49170.85,2526360,{"v":-0.032201714666605374,"d":"-3.22%"}]
[3,"Index","FINNIFTY","2024-05-28",{"v":21927.2,"d":"21927.20"},21908.95,{"v":21846.550000000003,"d":"21846.55"},{"v":21765.9,"d":"21765.90"},{"v":21703.500000000004,"d":"21703.50"},{"v":21989.600000000002,"d":"21989.60"},{"v":22052.000000000004,"d":"22052.00"},22132.65,21971.35,21828.3,56440,{"v":0.1297037630104083,"d":"12.97%"}]
[4,"Index","MIDCPNIFTY","2024-05-27",{"v":11193.5,"d":"11193.50"},{"v":11178.949999999999,"d":"11178.95"},{"v":11133.349999999999,"d":"11133.35"},{"v":11073.199999999999,"d":"11073.20"},{"v":11027.599999999999,"d":"11027.60"},{"v":11239.099999999999,"d":"11239.10"},{"v":11284.7,"d":"11284.70"},{"v":11344.849999999999,"d":"11344.85"},11224.55,11118.8,1935725,{"v":0.033406294210287485,"d":"3.34%"}]
[5,"Chemicals","AARTIIND","2024-05-30",749.85,{"v":747.5666666666666,"d":"747.57"},{"v":743.6333333333332,"d":"743.63"},{"v":737.4166666666666,"d":"737.42"},{"v":733.4833333333332,"d":"733.48"},{"v":753.7833333333332,"d":"753.78"},{"v":757.7166666666666,"d":"757.72"},{"v":763.9333333333332,"d":"763.93"},751.5,741.35,13828000,{"v":0.02825698988697204,"d":"2.83%"}]
[6,"Capital_Goods","ABB","2024-05-30",6722.25,{"v":6691.2,"d":"6691.20"},{"v":6603.049999999999,"d":"6603.05"},{"v":6483.849999999999,"d":"6483.85"},{"v":6395.699999999999,"d":"6395.70"},{"v":6810.4,"d":"6810.40"},{"v":6898.549999999999,"d":"6898.55"},7017.75,6779.35,6572,1130875,{"v":-0.023634793870062596,"d":"-2.36%"}]
[7,"Pharma","ABBOTINDIA","2024-05-30",26912.75,{"v":26758.650000000005,"d":"26758.65"},{"v":26529.25000000001,"d":"26529.25"},{"v":26145.750000000007,"d":"26145.75"},{"v":25916.350000000013,"d":"25916.35"},{"v":27142.15000000001,"d":"27142.15"},{"v":27371.550000000003,"d":"27371.55"},{"v":27755.050000000007,"d":"27755.05"},26988.05,26375.15,198280,{"v":-0.014120922832140016,"d":"-1.41%"}]
[8,"Finance","ABCAPITAL","2024-05-30",234.55,{"v":234.66666666666666,"d":"234.67"},{"v":232.88333333333333,"d":"232.88"},{"v":231.21666666666667,"d":"231.22"},{"v":229.43333333333334,"d":"229.43"},{"v":236.33333333333331,"d":"236.33"},{"v":238.11666666666667,"d":"238.12"},{"v":239.7833333333333,"d":"239.78"},236.45,233,69800400,{"v":0.01867759476712113,"d":"1.87%"}]
[9,"Textile","ABFRL","2024-05-30",266.35,{"v":266.8,"d":"266.80"},{"v":264.1,"d":"264.10"},261.85,{"v":259.15000000000003,"d":"259.15"},269.05,{"v":271.74999999999994,"d":"271.75"},{"v":274,"d":"274.00"},269.5,264.55,46293000,{"v":0.010040844111640572,"d":"1.00%"}]
[10,"Cement","ACC","2024-05-30",{"v":2549.9,"d":"2549.90"},{"v":2551.3666666666663,"d":"2551.37"},{"v":2538.2333333333327,"d":"2538.23"},{"v":2526.566666666666,"d":"2526.57"},{"v":2513.4333333333325,"d":"2513.43"},{"v":2563.033333333333,"d":"2563.03"},{"v":2576.166666666667,"d":"2576.17"},{"v":2587.833333333333,"d":"2587.83"},2564.5,2539.7,5587500,{"v":-0.015852047556142668,"d":"-1.59%"}]
{"$rows_left_out":194}
{"sheet":"Cash Intra","index":2,"n_rows":245,"n_cols":13,"rows_kept":245,"merged":[[7,0,8,0],[7,1,8,1],[7,2,8,2],[7,3,8,3],[7,4,7,6],[7,7,7,9]]}
[]
[]
[]
[]
[{"$nulls":12},"Back to Main Page"]
["FOR INTRA DAY TRADING",{"$nulls":9},{"$f":"Main!B10","v":"2024-05-03"}]
[]
["Sr.no",null,"CLOSE RATE","Pivot Point","Supports",null,null,"Resistances"]
[{"$nulls":4},"S1","S2","S3","R1","R2","R3","HIGH","LOW","Total Trade Quanity in Lakhs"]
[1,"Nifty 50",{"v":22648.2,"d":"22648.20"},{"v":22642.18333333333,"d":"22642.18"},{"v":22573.86666666666,"d":"22573.87"},{"v":22499.53333333333,"d":"22499.53"},{"v":22431.21666666666,"d":"22431.22"},{"v":22716.516666666663,"d":"22716.52"},{"v":22784.833333333336,"d":"22784.83"},{"v":22859.166666666664,"d":"22859.17"},{"v":22710.5,"d":"22710.50"},22567.85]
[2,"Nifty Bank",49231.05,{"v":49294.666666666664,"d":"49294.67"},{"v":49059.98333333333,"d":"49059.98"},{"v":48888.916666666664,"d":"48888.92"},{"v":48654.23333333333,"d":"48654.23"},{"v":49465.73333333333,"d":"49465.73"},{"v":49700.416666666664,"d":"49700.42"},{"v":49871.48333333333,"d":"49871.48"},49529.35,{"v":49123.6,"d":"49123.60"}]
[3,"Nifty CPSE",{"v":6336.6,"d":"6336.60"},{"v":6314.983333333334,"d":"6314.98"},{"v":6254.8166666666675,"d":"6254.82"},{"v":6173.033333333334,"d":"6173.03"},{"v":6112.866666666668,"d":"6112.87"},{"v":6396.766666666667,"d":"6396.77"},{"v":6456.933333333333,"d":"6456.93"},{"v":6538.716666666667,"d":"6538.72"},6375.15,{"v":6233.2,"d":"6233.20"}]
[4,"Nifty Infra",{"v":8630.5,"d":"8630.50"},8620.75,{"v":8591.6,"d":"8591.60"},{"v":8552.7,"d":"8552.70"},{"v":8523.550000000001,"d":"8523.55"},8659.65,{"v":8688.800000000001,"d":"8688.80"},{"v":8727.699999999999,"d":"8727.70"},{"v":8649.9,"d":"8649.90"},8581.85]
[5,"Nifty IT",33203.35,{"v":33198.28333333333,"d":"33198.28"},{"v":33064.36666666667,"d":"33064.37"},{"v":32925.38333333334,"d":"32925.38"},{"v":32791.466666666674,"d":"32791.47"},{"v":33337.26666666666,"d":"33337.27"},{"v":33471.183333333334,"d":"33471.18"},{"v":33610.16666666666,"d":"33610.17"},{"v":33332.2,"d":"33332.20"},{"v":33059.3,"d":"33059.30"}]
[6,"Nifty PSE",{"v":10222,"d":"10222.00"},{"v":10168.333333333334,"d":"10168.33"},{"v":10080.816666666668,"d":"10080.82"},{"v":9939.633333333333,"d":"9939.63"},{"v":9852.116666666667,"d":"9852.12"},{"v":10309.516666666668,"d":"10309.52"},{"v":10397.033333333335,"d":"10397.03"},{"v":10538.216666666669,"d":"10538.22"},10255.85,10027.15]
[7,"Nifty Midcap 50",{"v":14243.6,"d":"14243.60"},{"v":14222.866666666669,"d":"14222.87"},{"v":14185.283333333336,"d":"14185.28"},{"v":14126.966666666667,"d":"14126.97"},{"v":14089.383333333335,"d":"14089.38"},{"v":14281.183333333338,"d":"14281.18"},{"v":14318.76666666667,"d":"14318.77"},{"v":14377.08333333334,"d":"14377.08"},14260.45,14164.55]
[8,"ABB",6682.5,{"v":6658.483333333334,"d":"6658.48"},{"v":6569.016666666667,"d":"6569.02"},{"v":6455.533333333334,"d":"6455.53"},{"v":6366.0666666666675,"d":"6366.07"},{"v":6771.966666666667,"d":"6771.97"},{"v":6861.433333333334,"d":"6861.43"},{"v":6974.916666666667,"d":"6974.92"},6747.95,6545,3.17802]
[9,"ACC",2529.45,{"v":2534.3166666666666,"d":"2534.32"},{"v":2516.633333333333,"d":"2516.63"},{"v":2503.8166666666666,"d":"2503.82"},{"v":2486.133333333333,"d":"2486.13"},{"v":2547.133333333333,"d":"2547.13"},{"v":2564.8166666666666,"d":"2564.82"},{"v":2577.633333333333,"d":"2577.63"},2552,2521.5,4.77663]
[10,"APLAPOLLO",1590.2,{"v":1583.3333333333333,"d":"1583.33"},{"v":1570.6666666666665,"d":"1570.67"},{"v":1551.1333333333332,"d":"1551.13"},{"v":1538.4666666666665,"d":"1538.47"},{"v":1602.8666666666666,"d":"1602.87"},{"v":1615.533333333333,"d":"1615.53"},{"v":1635.0666666666666,"d":"1635.07"},1596,1563.8,5.39141]
[11,"AUBANK",645.3,{"v":642.7666666666667,"d":"642.77"},{"v":636.5333333333333,"d":"636.53"},{"v":627.7666666666667,"d":"627.77"},{"v":621.5333333333333,"d":"621.53"},{"v":651.5333333333333,"d":"651.53"},{"v":657.7666666666667,"d":"657.77"},{"v":666.5333333333333,"d":"666.53"},649,634,43.10835]
{"$rows_left_out":226}
{"sheet":"MidCap Intra","index":3,"n_rows":530,"n_cols":13,"rows_kept":530,"merged":[[0,0,0,1],[8,0,9,0],[8,1,9,1],[8,2,9,2],[8,3,9,3],[8,4,8,6],[8,7,8,9]]}
[]
[]
[]
[]
[{"$nulls":11},"Back To Main Page"]
["FOR INTRA DAY TRADING",{"$nulls":9},{"$f":"Main!B10","v":"2024-05-03"}]
[null,null," "]
[]
["Sr.no","Scrip","CLOSE RATE","Pivot Point","Supports",null,null,"Resistances"]
[{"$nulls":4},"S1","S2","S3","R1","R2","R3","HIGH","LOW","Total Trade Quanity in Lakhs"]
[1,"360ONE",774.05,{"v":776.9666666666667,"d":"776.97"},{"v":762.1833333333334,"d":"762.18"},{"v":750.3166666666667,"d":"750.32"},{"v":735.5333333333334,"d":"735.53"},{"v":788.8333333333334,"d":"788.83"},{"v":803.6166666666667,"d":"803.62"},{"v":815.4833333333333,"d":"815.48"},791.75,765.1,5.30029]
[2,"3MINDIA",29733.25,{"v":29977.766666666666,"d":"29977.77"},{"v":29355.533333333333,"d":"29355.53"},{"v":28977.816666666666,"d":"28977.82"},{"v":28355.583333333332,"d":"28355.58"},{"v":30355.483333333334,"d":"30355.48"},{"v":30977.716666666664,"d":"30977.72"},{"v":31355.433333333334,"d":"31355.43"},30600,29600.05,0.11917]
[3,"ABB",6682.5,{"v":6658.483333333334,"d":"6658.48"},{"v":6569.016666666667,"d":"6569.02"},{"v":6455.533333333334,"d":"6455.53"},{"v":6366.0666666666675,"d":"6366.07"},{"v":6771.966666666667,"d":"6771.97"},{"v":6861.433333333334,"d":"6861.43"},{"v":6974.916666666667,"d":"6974.92"},6747.95,6545,3.17802]
[4,"ACC",2529.45,{"v":2534.3166666666666,"d":"2534.32"},{"v":2516.633333333333,"d":"2516.63"},{"v":2503.8166666666666,"d":"2503.82"},{"v":2486.133333333333,"d":"2486.13"},{"v":2547.133333333333,"d":"2547.13"},{"v":2564.8166666666666,"d":"2564.82"},{"v":2577.633333333333,"d":"2577.63"},2552,2521.5,4.77663]
[5,"AIAENG",3780.2,{"v":3794.9666666666667,"d":"3794.97"},{"v":3745.2333333333336,"d":"3745.23"},{"v":3710.266666666667,"d":"3710.27"},{"v":3660.5333333333338,"d":"3660.53"},{"v":3829.9333333333334,"d":"3829.93"},{"v":3879.666666666666,"d":"3879.67"},{"v":3914.633333333333,"d":"3914.63"},3844.7,3760,0.46938]
[6,"APLAPOLLO",1590.2,{"v":1583.3333333333333,"d":"1583.33"},{"v":1570.6666666666665,"d":"1570.67"},{"v":1551.1333333333332,"d":"1551.13"},{"v":1538.4666666666665,"d":"1538.47"},{"v":1602.8666666666666,"d":"1602.87"},{"v":1615.533333333333,"d":"1615.53"},{"v":1635.0666666666666,"d":"1635.07"},1596,1563.8,5.39141]
[7,"AUBANK",645.3,{"v":642.7666666666667,"d":"642.77"},{"v":636.5333333333333,"d":"636.53"},{"v":627.7666666666667,"d":"627.77"},{"v":621.5333333333333,"d":"621.53"},{"v":651.5333333333333,"d":"651.53"},{"v":657.7666666666667,"d":"657.77"},{"v":666.5333333333333,"d":"666.53"},649,634,43.10835]
[8,"AARTIDRUGS",500.8,{"v":502.9166666666667,"d":"502.92"},{"v":496.8833333333334,"d":"496.88"},{"v":492.9666666666667,"d":"492.97"},{"v":486.9333333333334,"d":"486.93"},{"v":506.83333333333337,"d":"506.83"},{"v":512.8666666666667,"d":"512.87"},{"v":516.7833333333333,"d":"516.78"},508.95,499,0.62037]
[9,"AARTIIND",742.75,{"v":741.6,"d":"741.60"},736.95,731.15,{"v":726.5,"d":"726.50"},{"v":747.4000000000001,"d":"747.40"},752.05,{"v":757.8500000000001,"d":"757.85"},746.25,735.8,8.83662]
[10,"AAVAS",1597.35,{"v":1606.1166666666668,"d":"1606.12"},{"v":1584.2333333333336,"d":"1584.23"},{"v":1571.1166666666668,"d":"1571.12"},{"v":1549.2333333333336,"d":"1549.23"},{"v":1619.2333333333336,"d":"1619.23"},{"v":1641.1166666666668,"d":"1641.12"},{"v":1654.2333333333336,"d":"1654.23"},1628,1593,3.11886]
{"$rows_left_out":511}
{"sheet":"Bulk Deals","index":4,"n_rows":227,"n_cols":8,"rows_kept":227,"merged":[[4,0,4,1],[4,2,4,3],[6,1,6,2]]}
[" "]
[]
[]
[]
[]
[{"$nulls":4},"Back To Main Page"]
["Subject :","BULK DEAL",null,{"$f":"Main!B10","v":"2024-05-03"}]
[]
["Date","Scrip code","Scrip Name","Client Name","Buy / Sell","Quantity Traded","Trade Price / Wt.Avg.trade price","Exchange  "]
["2024-05-02",543319,"AAPLUSTRAD","MAHADEV MANUBHAI MAKVANA","BUY",{"v":168000,"d":"168,000"},17.59,"BSE"]
["2024-05-02",543804,"AMANAYA","SOMANI VENTURES AND INNOVATIONS LIMITED","BUY",{"v":24000,"d":"24,000"},24.95,"BSE"]
["2024-05-02",537069,"ARNOLD","LAKSHMISHREE INVESTMENT & SECURITIES PRIVATE LIMITED","BUY",{"v":125000,"d":"125,000"},41.07,"BSE"]
["2024-05-02",539662,"BFLAFL","NIPA MANTHAN SANGHAVI","SELL",{"v":124215,"d":"124,215"},18.64,"BSE"]
["2024-05-02",539662,"BFLAFL","DEEPIKA MURTY MALLA","SELL",{"v":50590,"d":"50,590"},18.4,"BSE"]
["2024-05-02",539662,"BFLAFL","NIPA MANTHAN SANGHAVI","BUY",{"v":160000,"d":"160,000"},19,"BSE"]
["2024-05-02",539662,"BFLAFL","NANDAN KANAN BARTER PVT LTD","SELL",{"v":151283,"d":"151,283"},17.76,"BSE"]
["2024-05-02",539662,"BFLAFL","SETU SECURITIES PVT. LTD.","SELL",{"v":50000,"d":"50,000"},18.28,"BSE"]
["2024-05-02",539662,"BFLAFL","SETU SECURITIES PVT. LTD.","BUY",{"v":55000,"d":"55,000"},17.63,"BSE"]
["2024-05-02",539662,"BFLAFL","PRAGATI DREAMLAND DEVELOPERS PRIVATE LIMITED","SELL",{"v":382244,"d":"382,244"},19.56,"BSE"]
["2024-05-02",539662,"BFLAFL","NIRANJANA PRIME DEVELOPERS PRIVATE LIMITED","SELL",{"v":90000,"d":"90,000"},18.78,"BSE"]
{"$rows_left_out":208}
{"sheet":"Call Tracker (Equity & F&O)","index":5,"n_rows":285,"n_cols":19,"rows_kept":285,"merged":[[39,0,40,0],[39,1,40,1],[39,9,40,9],[39,15,40,15],[41,0,42,0],[41,1,42,1],[41,9,42,9],[41,12,42,12],[41,14,42,14],[41,15,42,15],[45,0,46,0],[45,1,46,1],[45,9,46,9],[45,12,46,12],[45,14,46,14],[45,15,46,15],[47,0,48,0],[47,1,48,1],[47,9,48,9],[47,12,48,12],[47,14,48,14],[47,15,48,15]]}
[]
[]
[]
[]
[{"$nulls":12},"Back To Main Page"]
["Retail Research Technical Calls & Fundamental Performance Report for the month of May-2024"]
[{"$nulls":12},{"$f":"Main!B10","v":"2024-05-03"}]
[null,"Positional  Call"]
["Sr.no","Date",null,"Company","Rec","Rec Price","Stop Loss***","Call Closed At","Target","Remark","Profit / Loss per Share","All charges","Net Gain / Loss  %","Status","Closed Date","Market Closing Price","Second Buying Date"]
[1,"2024-03-11",null,"NESTLEIND","Accu","2485-2585",2390,null,"2800-3000","Open",{"$nulls":5},{"$f":"VLOOKUP(D10,'MidCap Intra'!$B$11:$C$568,2,0)","v":{"v":2512.3,"d":"2512.30"}},null,null,"H"]
[2,"2024-03-22",null,"TCS","Accu","3780-3880",3640,null,"4100-4200","Open",{"$nulls":5},{"$f":"VLOOKUP(D11,'MidCap Intra'!$B$11:$C$568,2,0)","v":{"v":3863.3,"d":"3863.30"}},null,null,"H"]
[3,"2024-04-03",null,"BRITANNIA","Accu","4710-4810",4580,null,"5050-5300","Open",{"$nulls":5},{"$f":"VLOOKUP(D12,'MidCap Intra'!$B$11:$C$568,2,0)","v":4759.65},null,null,"H"]
[4,"2024-04-12",null,"GLAND","Accu","1705-1750",1625,null,"1875-2000","Open",{"$nulls":5},{"$f":"VLOOKUP(D13,'MidCap Intra'!$B$11:$C$568,2,0)","v":{"v":1722.3,"d":"1722.30"}},null,null,"K"]
[5,"2024-04-15",null,"HDFCBANK","Accu","1445-1497",1377,null,"1630-1750","Open",{"$nulls":5},{"$f":"VLOOKUP(D14,'MidCap Intra'!$B$11:$C$568,2,0)","v":1532.25},null,null,"H"]
[6,"2024-04-23",null,"PRSMJOHNSN","Accu","158-164",149.5,null,"180-195","Open",{"$nulls":5},{"$f":"VLOOKUP(D15,'MidCap Intra'!$B$11:$C$568,2,0)","v":162.75},null,null,"H"]
[7,"2024-04-29",null,"SUNTV","Accu","632.5-652.5",618,null,"695-730","Open",{"$nulls":5},{"$f":"VLOOKUP(D16,'MidCap Intra'!$B$11:$C$568,2,0)","v":{"v":657.8,"d":"657.80"}},null,null,"H"]
[8,"2024-04-30",null,"LTF","Accu","162-169",159,null,"180-190","Open",{"$nulls":5},{"$f":"VLOOKUP(D17,'MidCap Intra'!$B$11:$C$568,2,0)","v":169.75},null,null,"H"]
[9,"2024-04-30",null,"KPITTECH","Accu","1410-1480",1360,null,"1600-1700","Open",{"$nulls":5},{"$f":"VLOOKUP(D18,'MidCap Intra'!$B$11:$C$568,2,0)","v":{"v":1512.2,"d":"1512.20"}},null,null,"H"]
[10,"2024-05-02",null,"HCLTECH","Accu","1310-1360",1285,null,"1435-1510","Open",{"$nulls":5},{"$f":"VLOOKUP(D19,'MidCap Intra'!$B$11:$C$568,2,0)","v":{"v":1360.7,"d":"1360.70"}},null,null,"H"]
[]
{"$rows_left_out":258}