{"text_format":"3","workbook":"xlsx","n_sheets":6,"sheets":["Main","Future Intra","Cash Intra","MidCap Intra","Bulk Deals","Call Tracker (Equity & F&O)"],"not_rendered":{"images":4,"defined_names":1},"read":"whole","date_system":"1900"}

{"sheet":"Main","index":0,"n_rows":27,"n_cols":11,"rows_kept":27}
[null,"                                                                                                 "]
[]
[]
[]
[]
[{"$nulls":6}," "]
[]
[]
[]
[null,"2024-05-16"]
[]
[null,"Sheet No.","Template Name","Summary"]
[null,1,"Future Intra","For Intraday trading in F&O segment"]
[null,2,"Cash Intra","For Intraday trading in cash market segment"]
[null,3,"Mid-cap Intra","For Intraday trading in Mid-cap stocks"]
[null,4,"Bulk Deals","Reveals Bulk Deals carried on NSE & BSE"]
[null,5,"Call Tracker"]
{"$rows_empty":9}
[{"$nulls":10},"`"]

{"sheet":"Future Intra","index":1,"n_rows":236,"n_cols":16,"rows_kept":236,"merged":[[8,0,9,0],[8,1,9,1],[8,2,9,2],[8,3,9,3],[8,6,8,8],[8,9,8,11]]}
[]
[]
[]
[]
[{"$nulls":12},"Back to Main Page"]
["FOR INTRA DAY TRADING",{"$nulls":10},{"$f":"Main!B10","v":"2024-05-16"}]
[]
[]
["Sr.no","Sector","Scrip","Expiry Date","CLOSE RATE","Pivot Point","Supports",null,null,"Resistances"]
[{"$nulls":4},"Point","Point","S1","S2","S3","R1","R2","R3","HIGH","LOW","OI","% Change in OI"]
[1,"Index","NIFTY","2024-05-30",22287.05,{"v":22291.166666666668,"d":"22291.17"},{"v":22206.883333333335,"d":"22206.88"},{"v":22126.716666666667,"d":"22126.72"},{"v":22042.433333333334,"d":"22042.43"},{"v":22371.333333333336,"d":"22371.33"},{"v":22455.61666666667,"d":"22455.62"},{"v":22535.783333333336,"d":"22535.78"},22375.45,22211,15013825,{"v":-0.009970309973112474,"d":"-1.00%"}]
[2,"Index","BANKNIFTY","2024-05-29",47908.55,{"v":47928.23333333334,"d":"47928.23"},{"v":47711.31666666667,"d":"47711.32"},{"v":47514.083333333336,"d":"47514.08"},{"v":47297.16666666667,"d":"47297.17"},{"v":48125.466666666674,"d":"48125.47"},{"v":48342.38333333333,"d":"48342.38"},{"v":48539.616666666676,"d":"48539.62"},48145.15,47731,2890215,{"v":0.05348882983958272,"d":"5.35%"}]
[3,"Index","FINNIFTY","2024-05-28",{"v":21289.1,"d":"21289.10"},21295.45,{"v":21214.800000000003,"d":"21214.80"},{"v":21140.500000000004,"d":"21140.50"},{"v":21059.850000000006,"d":"21059.85"},21369.75,{"v":21450.4,"d":"21450.40"},{"v":21524.699999999997,"d":"21524.70"},21376.1,21221.15,94235,{"v":0.21554337310544985,"d":"21.55%"}]
[4,"Index","MIDCPNIFTY","2024-05-27",11188.75,{"v":11167.916666666666,"d":"11167.92"},{"v":11137.033333333333,"d":"11137.03"},{"v":11085.316666666668,"d":"11085.32"},{"v":11054.433333333334,"d":"11054.43"},{"v":11219.633333333331,"d":"11219.63"},{"v":11250.516666666666,"d":"11250.52"},{"v":11302.23333333333,"d":"11302.23"},11198.8,11116.2,2124825,{"v":0.012785986653956149,"d":"1.28%"}]
[5,"Chemicals","AARTIIND","2024-05-30",{"v":623.6,"d":"623.60"},{"v":633.6166666666667,"d":"633.62"},{"v":610.9833333333333,"d":"610.98"},{"v":598.3666666666667,"d":"598.37"},{"v":575.7333333333333,"d":"575.73"},{"v":646.2333333333333,"d":"646.23"},{"v":668.8666666666668,"d":"668.87"},{"v":681.4833333333333,"d":"681.48"},656.25,621,13132000,{"v":-0.061195310265942236,"d":"-6.12%"}]
[6,"Capital_Goods","ABB","2024-05-30",8097.65,{"v":8078.2,"d":"8078.20"},8003.95,7910.25,{"v":7836,"d":"7836.00"},{"v":8171.9,"d":"8171.90"},8246.15,{"v":8339.849999999999,"d":"8339.85"},8152.45,7984.5,1404000,{"v":0.003394675719135251,"d":"0.34%"}]
[7,"Pharma","ABBOTINDIA","2024-05-30",{"v":26516.1,"d":"26516.10"},26656.95,{"v":26323.800000000003,"d":"26323.80"},{"v":26131.500000000004,"d":"26131.50"},{"v":25798.350000000006,"d":"25798.35"},26849.25,{"v":27182.4,"d":"27182.40"},{"v":27374.699999999997,"d":"27374.70"},26990.1,26464.65,165200,{"v":0.005477784540474742,"d":"0.55%"}]
[8,"Finance","ABCAPITAL","2024-05-30",{"v":221.4,"d":"221.40"},{"v":222.5,"d":"222.50"},{"v":219.6,"d":"219.60"},{"v":217.79999999999998,"d":"217.80"},{"v":214.89999999999998,"d":"214.90"},{"v":224.3,"d":"224.30"},{"v":227.2,"d":"227.20"},{"v":229.00000000000003,"d":"229.00"},225.4,220.7,70302600,{"v":-0.005423987776928953,"d":"-0.54%"}]
[9,"Textile","ABFRL","2024-05-30",{"v":263.6,"d":"263.60"},{"v":263.68333333333334,"d":"263.68"},{"v":259.76666666666665,"d":"259.77"},{"v":255.93333333333334,"d":"255.93"},{"v":252.01666666666665,"d":"252.02"},{"v":267.51666666666665,"d":"267.52"},{"v":271.4333333333333,"d":"271.43"},{"v":275.26666666666665,"d":"275.27"},267.6,259.85,40250600,{"v":0.013884340821271858,"d":"1.39%"}]
[10,"Cement","ACC","2024-05-30",2494.25,{"v":2484.5333333333333,"d":"2484.53"},{"v":2461.8166666666666,"d":"2461.82"},{"v":2429.383333333333,"d":"2429.38"},{"v":2406.6666666666665,"d":"2406.67"},{"v":2516.9666666666667,"d":"2516.97"},{"v":2539.683333333333,"d":"2539.68"},{"v":2572.116666666667,"d":"2572.12"},2507.25,2452.1,5337900,{"v":-0.027013725597418933,"d":"-2.70%"}]
{"$rows_left_out":194}
{"sheet":"Cash Intra","index":2,"n_rows":245,"n_cols":13,"rows_kept":245,"merged":[[7,0,8,0],[7,1,8,1],[7,2,8,2],[7,3,8,3],[7,4,7,6],[7,7,7,9]]}
[]
[]
[]
[]
[{"$nulls":12},"Back to Main Page"]
["FOR INTRA DAY TRADING",{"$nulls":9},{"$f":"Main!B10","v":"2024-05-16"}]
[]
["Sr.no",null,"CLOSE RATE","Pivot Point","Supports",null,null,"Resistances"]
[{"$nulls":4},"S1","S2","S3","R1","R2","R3","HIGH","LOW","Total Trade Quanity in Lakhs"]
[1,"Nifty 50",22200.55,{"v":22216.61666666667,"d":"22216.62"},{"v":22135.683333333338,"d":"22135.68"},{"v":22070.81666666667,"d":"22070.82"},{"v":21989.88333333334,"d":"21989.88"},{"v":22281.483333333337,"d":"22281.48"},{"v":22362.41666666667,"d":"22362.42"},{"v":22427.283333333336,"d":"22427.28"},22297.55,22151.75]
[2,"Nifty Bank",47687.45,{"v":47726.38333333333,"d":"47726.38"},{"v":47495.566666666666,"d":"47495.57"},{"v":47303.683333333334,"d":"47303.68"},{"v":47072.86666666667,"d":"47072.87"},{"v":47918.26666666666,"d":"47918.27"},{"v":48149.08333333333,"d":"48149.08"},{"v":48340.96666666666,"d":"48340.97"},{"v":47957.2,"d":"47957.20"},{"v":47534.5,"d":"47534.50"}]
[3,"Nifty CPSE",{"v":6291.5,"d":"6291.50"},{"v":6270.916666666667,"d":"6270.92"},{"v":6235.983333333334,"d":"6235.98"},{"v":6180.466666666666,"d":"6180.47"},{"v":6145.533333333333,"d":"6145.53"},{"v":6326.433333333334,"d":"6326.43"},{"v":6361.366666666667,"d":"6361.37"},{"v":6416.883333333335,"d":"6416.88"},6305.85,{"v":6215.4,"d":"6215.40"}]
[4,"Nifty Infra",{"v":8488.3,"d":"8488.30"},{"v":8471.933333333332,"d":"8471.93"},{"v":8437.566666666666,"d":"8437.57"},{"v":8386.833333333334,"d":"8386.83"},{"v":8352.466666666667,"d":"8352.47"},{"v":8522.666666666664,"d":"8522.67"},{"v":8557.03333333333,"d":"8557.03"},{"v":8607.766666666663,"d":"8607.77"},{"v":8506.3,"d":"8506.30"},{"v":8421.2,"d":"8421.20"}]
[5,"Nifty IT",{"v":33117.4,"d":"33117.40"},{"v":33131.933333333334,"d":"33131.93"},{"v":32971.51666666667,"d":"32971.52"},{"v":32825.63333333334,"d":"32825.63"},{"v":32665.216666666674,"d":"32665.22"},{"v":33277.816666666666,"d":"33277.82"},{"v":33438.23333333332,"d":"33438.23"},{"v":33584.11666666666,"d":"33584.12"},33292.35,32986.05]
[6,"Nifty PSE",{"v":10090.3,"d":"10090.30"},{"v":10051.733333333334,"d":"10051.73"},{"v":9992.016666666666,"d":"9992.02"},{"v":9893.733333333334,"d":"9893.73"},{"v":9834.016666666666,"d":"9834.02"},{"v":10150.016666666666,"d":"10150.02"},{"v":10209.733333333334,"d":"10209.73"},{"v":10308.016666666666,"d":"10308.02"},10111.45,9953.45]
[7,"Nifty Midcap 50",14262.55,{"v":14233.266666666668,"d":"14233.27"},{"v":14185.283333333336,"d":"14185.28"},{"v":14108.016666666668,"d":"14108.02"},{"v":14060.033333333336,"d":"14060.03"},{"v":14310.533333333336,"d":"14310.53"},{"v":14358.51666666667,"d":"14358.52"},{"v":14435.783333333336,"d":"14435.78"},14281.25,{"v":14156,"d":"14156.00"}]
[8,"ABB",8084.3,{"v":8058.166666666667,"d":"8058.17"},{"v":7991.333333333334,"d":"7991.33"},{"v":7898.366666666667,"d":"7898.37"},{"v":7831.533333333334,"d":"7831.53"},{"v":8151.133333333334,"d":"8151.13"},{"v":8217.966666666667,"d":"8217.97"},{"v":8310.933333333334,"d":"8310.93"},8125,7965.2,4.60611]
[9,"ACC",2489.15,{"v":2480.8166666666666,"d":"2480.82"},{"v":2459.633333333333,"d":"2459.63"},{"v":2430.116666666667,"d":"2430.12"},{"v":2408.9333333333334,"d":"2408.93"},{"v":2510.333333333333,"d":"2510.33"},{"v":2531.5166666666664,"d":"2531.52"},{"v":2561.033333333333,"d":"2561.03"},2502,2451.3,4.74968]
[10,"APLAPOLLO",1580.2,1584.55,{"v":1562.1,"d":"1562.10"},{"v":1544,"d":"1544.00"},1521.55,{"v":1602.6499999999999,"d":"1602.65"},{"v":1625.1000000000001,"d":"1625.10"},{"v":1643.1999999999998,"d":"1643.20"},1607,1566.45,6.78661]
[11,"AUBANK",622.95,{"v":629.5666666666666,"d":"629.57"},{"v":610.2333333333332,"d":"610.23"},{"v":597.5166666666667,"d":"597.52"},{"v":578.1833333333333,"d":"578.18"},{"v":642.2833333333332,"d":"642.28"},{"v":661.6166666666667,"d":"661.62"},{"v":674.3333333333331,"d":"674.33"},648.9,616.85,46.54837]
{"$rows_left_out":226}
{"sheet":"MidCap Intra","index":3,"n_rows":530,"n_cols":13,"rows_kept":530,"merged":[[0,0,0,1],[8,0,9,0],[8,1,9,1],[8,2,9,2],[8,3,9,3],[8,4,8,6],[8,7,8,9]]}
[]
[]
[]
[]
[{"$nulls":11},"Back To Main Page"]
["FOR INTRA DAY TRADING",{"$nulls":9},{"$f":"Main!B10","v":"2024-05-16"}]
[null,null," "]
[]
["Sr.no","Scrip","CLOSE RATE","Pivot Point","Supports",null,null,"Resistances"]
[{"$nulls":4},"S1","S2","S3","R1","R2","R3","HIGH","LOW","Total Trade Quanity in Lakhs"]
[1,"360ONE",754.9,{"v":758.9833333333332,"d":"758.98"},{"v":748.1166666666664,"d":"748.12"},{"v":741.3333333333333,"d":"741.33"},{"v":730.4666666666665,"d":"730.47"},{"v":765.7666666666664,"d":"765.77"},{"v":776.6333333333332,"d":"776.63"},{"v":783.4166666666664,"d":"783.42"},769.85,752.2,1.5261]
[2,"3MINDIA",28619.05,{"v":28772.333333333332,"d":"28772.33"},{"v":28345.666666666664,"d":"28345.67"},{"v":28072.283333333333,"d":"28072.28"},{"v":27645.616666666665,"d":"27645.62"},{"v":29045.716666666664,"d":"29045.72"},{"v":29472.383333333328,"d":"29472.38"},{"v":29745.766666666663,"d":"29745.77"},29199,28498.95,0.02795]
[3,"ABB",8084.3,{"v":8058.166666666667,"d":"8058.17"},{"v":7991.333333333334,"d":"7991.33"},{"v":7898.366666666667,"d":"7898.37"},{"v":7831.533333333334,"d":"7831.53"},{"v":8151.133333333334,"d":"8151.13"},{"v":8217.966666666667,"d":"8217.97"},{"v":8310.933333333334,"d":"8310.93"},8125,7965.2,4.60611]
[4,"ACC",2489.15,{"v":2480.8166666666666,"d":"2480.82"},{"v":2459.633333333333,"d":"2459.63"},{"v":2430.116666666667,"d":"2430.12"},{"v":2408.9333333333334,"d":"2408.93"},{"v":2510.333333333333,"d":"2510.33"},{"v":2531.5166666666664,"d":"2531.52"},{"v":2561.033333333333,"d":"2561.03"},2502,2451.3,4.74968]
[5,"AIAENG",3755.45,{"v":3736.4499999999994,"d":"3736.45"},{"v":3665.049999999999,"d":"3665.05"},{"v":3574.6499999999996,"d":"3574.65"},{"v":3503.249999999999,"d":"3503.25"},{"v":3826.8499999999985,"d":"3826.85"},{"v":3898.249999999999,"d":"3898.25"},{"v":3988.6499999999983,"d":"3988.65"},3807.85,3646.05,0.98658]
[6,"APLAPOLLO",1580.2,1584.55,{"v":1562.1,"d":"1562.10"},{"v":1544,"d":"1544.00"},1521.55,{"v":1602.6499999999999,"d":"1602.65"},{"v":1625.1000000000001,"d":"1625.10"},{"v":1643.1999999999998,"d":"1643.20"},1607,1566.45,6.78661]
[7,"AUBANK",622.95,{"v":629.5666666666666,"d":"629.57"},{"v":610.2333333333332,"d":"610.23"},{"v":597.5166666666667,"d":"597.52"},{"v":578.1833333333333,"d":"578.18"},{"v":642.2833333333332,"d":"642.28"},{"v":661.6166666666667,"d":"661.62"},{"v":674.3333333333331,"d":"674.33"},648.9,616.85,46.54837]
[8,"AARTIDRUGS",480.3,{"v":479.4166666666667,"d":"479.42"},{"v":474.83333333333337,"d":"474.83"},{"v":469.3666666666667,"d":"469.37"},{"v":464.78333333333336,"d":"464.78"},{"v":484.8833333333334,"d":"484.88"},{"v":489.46666666666675,"d":"489.47"},{"v":494.9333333333334,"d":"494.93"},484,473.95,0.66341]
[9,"AARTIIND",621.9,{"v":631.4833333333332,"d":"631.48"},{"v":610.5166666666664,"d":"610.52"},{"v":599.1333333333332,"d":"599.13"},{"v":578.1666666666664,"d":"578.17"},{"v":642.8666666666664,"d":"642.87"},{"v":663.8333333333334,"d":"663.83"},{"v":675.2166666666665,"d":"675.22"},652.45,620.1,40.43426]
[10,"AAVAS",1577.3,{"v":1572.8500000000001,"d":"1572.85"},{"v":1553.0000000000002,"d":"1553.00"},{"v":1528.7,"d":"1528.70"},{"v":1508.8500000000001,"d":"1508.85"},{"v":1597.1500000000003,"d":"1597.15"},{"v":1617.0000000000002,"d":"1617.00"},{"v":1641.3000000000004,"d":"1641.30"},1592.7,1548.55,2.38308]
{"$rows_left_out":511}
{"sheet":"Bulk Deals","index":4,"n_rows":159,"n_cols":8,"rows_kept":159,"merged":[[4,0,4,1],[4,2,4,3],[6,1,6,2]]}
[" "]
[]
[]
[]
[]
[{"$nulls":4},"Back To Main Page"]
["Subject :","BULK DEAL",null,{"$f":"Main!B10","v":"2024-05-16"}]
[]
["Date","Scrip code","Scrip Name","Client Name","Buy / Sell","Quantity Traded","Trade Price / Wt.Avg.trade price","Exchange  "]
["2024-05-15",540829,"CHANDRIMA","SONALBEN RANAJITBHAI MISTRI","BUY",{"v":50018,"d":"50,018"},10.5,"BSE"]
["2024-05-15",540829,"CHANDRIMA","ANILKUMAR","SELL",{"v":47224,"d":"47,224"},10.5,"BSE"]
["2024-05-15",524752,"DECIPHER","RAJESH MANUBHAI SHAH","SELL",{"v":71000,"d":"71,000"},14.94,"BSE"]
["2024-05-15",537707,"ETT","SETU SECURITIES PVT. LTD.","SELL",{"v":15488,"d":"15,488"},23.22,"BSE"]
["2024-05-15",537707,"ETT","SETU SECURITIES PVT. LTD.","BUY",{"v":75488,"d":"75,488"},23.22,"BSE"]
["2024-05-15",537707,"ETT","SANTOSH KUMAR KUSHAWAHA","BUY",{"v":103910,"d":"103,910"},23.22,"BSE"]
["2024-05-15",537707,"ETT","SANTOSH KUMAR KUSHAWAHA","SELL",{"v":108027,"d":"108,027"},24.04,"BSE"]
["2024-05-15",537707,"ETT","RDS CORPORATE SERVICES PRIVATE LIMITED","BUY",{"v":31358,"d":"31,358"},25.45,"BSE"]
["2024-05-15",537707,"ETT","RDS CORPORATE SERVICES PRIVATE LIMITED","SELL",{"v":143499,"d":"143,499"},23.44,"BSE"]
["2024-05-15",537707,"ETT","KAMAL KUMAR JALAN SEC. PVT. LTD","BUY",{"v":55009,"d":"55,009"},23.22,"BSE"]
["2024-05-15",537707,"ETT","KAMAL KUMAR JALAN SEC. PVT. LTD","SELL",{"v":33547,"d":"33,547"},23.22,"BSE"]
{"$rows_left_out":140}
{"sheet":"Call Tracker (Equity & F&O)","index":5,"n_rows":339,"n_cols":18,"rows_kept":339,"merged":[[52,0,53,0],[52,1,53,1],[52,9,53,9],[52,14,53,14],[52,15,53,15],[62,0,63,0],[62,1,63,1],[62,9,63,9],[62,12,63,12],[62,14,63,14],[62,15,63,15],[64,0,65,0],[64,1,65,1],[64,9,65,9],[64,12,65,12],[64,14,65,14],[64,15,65,15],[68,0,69,0],[68,1,69,1],[68,9,69,9],[68,12,69,12],[68,14,69,14],[68,15,69,15],[70,0,71,0],[70,1,71,1],[70,9,71,9],[70,12,71,12],[70,14,71,14],[70,15,71,15],[72,0,73,0],[72,1,73,1],[72,9,73,9],[72,12,73,12],[72,14,73,14],[72,15,73,15],[79,0,80,0],[79,1,80,1],[79,9,80,9],[79,12,80,12],[79,14,80,14],[79,15,80,15],[83,0,84,0],[83,1,84,1],[83,9,84,9],[83,12,84,12],[83,14,84,14],[83,15,84,15],[85,0,86,0],[85,1,86,1],[85,9,86,9],[85,12,86,12],[85,14,86,14],[85,15,86,15],[88,0,89,0],[88,1,89,1],[88,9,89,9],[88,12,89,12],[88,14,89,14],[88,15,89,15],[97,0,98,0],[97,1,98,1],[97,9,98,9],[97,12,98,12],[97,14,98,14],[97,15,98,15],[99,0,100,0],[99,1,100,1],[99,9,100,9],[99,12,100,12],[99,14,100,14],[99,15,100,15]]}
[]
[]
[]
[]
[{"$nulls":12},"Back To Main Page"]
["Retail Research Technical Calls & Fundamental Performance Report for the month of May-2024"]
[{"$nulls":12},{"$f":"Main!B10","v":"2024-05-16"}]
[null,"Positional  Call"]
["Sr.no","Date",null,"Company","Rec","Rec Price","Stop Loss***","Call Closed At","Target","Remark","Profit / Loss per Share","All charges","Net Gain / Loss  %","Status","Closed Date","Market Closing Price","Second Buying Date"]
[1,"2024-03-11",null,"NESTLEIND","Accu","2485-2585",2390,null,"2800-3000","Open",{"$nulls":5},{"$f":"VLOOKUP(D10,'MidCap Intra'!$B$11:$C$568,2,0)","v":{"v":2465,"d":"2465.00"}},null,"H"]
[2,"2024-03-22",null,"TCS","Accu <>","3752-3852",3612,null,"4072-4172","Open",{"$nulls":5},{"$f":"VLOOKUP(D11,'MidCap Intra'!$B$11:$C$568,2,0)","v":{"v":3880.4,"d":"3880.40"}},null,"H"]
[3,"2024-04-03",null,"BRITANNIA","Accu",4760,4580,4965,"5050-5300","Profit of Rs.205/-",{"$f":"H12-F12","v":205},{"$f":"(F12*-0.3)/100","v":-14.28},{"$f":"(K12+L12)/F12","v":{"v":0.0400672268907563,"d":"4.01%"}},"Successful","2024-05-06",null,null,"H"]
[4,"2024-04-12",null,"GLAND","Accu","1705-1750",1625,null,"1875-2000","Open",{"$nulls":5},{"$f":"VLOOKUP(D13,'MidCap Intra'!$B$11:$C$568,2,0)","v":{"v":1775.2,"d":"1775.20"}},null,"K"]
[5,"2024-04-15",null,"HDFCBANK","Accu <>","1425.5-1477.5",1357.5,null,"1610.5-1730.5","Open",{"$nulls":5},{"$f":"VLOOKUP(D14,'MidCap Intra'!$B$11:$C$568,2,0)","v":{"v":1438.5,"d":"1438.50"}},null,"H"]
[6,"2024-04-23",null,"PRSMJOHNSN","Accu",161,149.5,148.5,"180-195","Loss of Rs.12.5 /-",{"$f":"H15-F15","v":-12.5},{"$f":"(F15*-0.3)/100","v":{"v":-0.483,"d":"-0.48"}},{"$f":"(K15+L15)/F15","v":{"v":-0.08063975155279503,"d":"-8.06%"}},"Unsuccessful","2024-05-13",null,null,"H"]
[7,"2024-04-29",null,"SUNTV","Accu",642.5,618,669.5,"695-730","Profit of Rs.27/-",{"$f":"H16-F16","v":27},{"$f":"(F16*-0.3)/100","v":{"v":-1.9275,"d":"-1.93"}},{"$f":"(K16+L16)/F16","v":{"v":0.039023346303501946,"d":"3.90%"}},"Successful","2024-05-10",null,null,"H"]
[8,"2024-04-30",null,"LTF","Accu",165.5,159,158.5,"180-190","Loss of Rs.7/-",{"$f":"H17-F17","v":-7},{"$f":"(F17*-0.3)/100","v":{"v":-0.4965,"d":"-0.50"}},{"$f":"(K17+L17)/F17","v":{"v":-0.045296072507552874,"d":"-4.53%"}},"Unsuccessful","2024-05-09",null,null,"H"]
[9,"2024-04-30",null,"KPITTECH","Accu","1410-1480",1360,null,"1600-1700","Open",{"$nulls":5},{"$f":"VLOOKUP(D18,'MidCap Intra'!$B$11:$C$568,2,0)","v":1493.25},null,"H"]
[10,"2024-05-02",null,"HCLTECH","Accu <>","1292-1342",1267,null,"1417-1492","Open",{"$nulls":5},{"$f":"VLOOKUP(D19,'MidCap Intra'!$B$11:$C$568,2,0)","v":{"v":1332.9,"d":"1332.90"}},null,"H"]
[11,"2024-05-06",null,"COALINDIA","Accu","445-455",428,null,"490-500","Open",{"$nulls":5},{"$f":"VLOOKUP(D20,'MidCap Intra'!$B$11:$C$568,2,0)","v":467.85},null,"H"]
{"$rows_left_out":312}